{"text_format":"1","workbook":"xlsx","n_sheets":5,"sheets":["Start here","1) screener questions","2) potential programs","3) short list ","policies"],"not_rendered":{"charts":0,"images":2,"macros":1,"external_links":0,"defined_names":3,"comments":0,"pivot_tables":0},"unopened":[],"bounds":{"document_bytes":16777216,"sheet_cells":100000,"rows_first":2000,"rows_last":500,"rows_between":2000,"halvings":0,"cell_chars":16384,"cell_head_chars":4096},"cells_cut":0,"cells_raw":0,"read":"whole","date_system":"1900"}

{"sheet":"Start here","index":0,"n_rows":18,"n_cols":1,"rows_kept":18,"cut":false,"hidden":false,"merged":[]}
[]
["Your friendly neighborhood Housing Policy Bot (\"PBot\"): An overview \nOn Tab 1) screener questions, you will answer a series of questions about what is going on in your jurisdiction. Click the grey button, and you be led to potential policies and programs to consider on Tab 2) potential programs. Mark which policies and programs you are interested in, click another button, and the Tab 3) short list will pull over the list of policies and programs that you thought were most relevant, so you can easily edit them/move them over to a Word document. "]
[]
["Instructions:"]
["Macros must be enabled."]
["Review the questions on Tab 1, choosing yes, no or maybe. "]
["Click the \"Show Potential Policies\" button on the right. Tab 2 will automatically open."]
["Review the potential policies and programs, clicking yes, no or maybe on these more specific suggestions."]
["In Tab 2 you can insert rows to add your own policies and programs  to the list."]
["Click \"Show short list\" button on the right, and Tab 3 will automatically open, showing your short list."]
["Copy and paste the suggested policies into a word processing document so you can further edit. "]
[]
["Notes and Disclaimers:"]
["This won't solve all your problems. You still need to tailor it. There are many more good policies not on the list. "]
["Did I mention that macros have to be enabled?"]
["Sometimes a policy/program will show up twice in the \"potential programs\" list. This is because some policies and programs are matched with multiple screener questions."]
["Do not delete the blank row 47 in the \"policies\" tab. This will cause a glitch if you try to add your own rows in Tab 2."]
["Send fanmail and suggestions to pbot@bdplanning.com"]

{"sheet":"1) screener questions","index":1,"n_rows":27,"n_cols":3,"rows_kept":27,"cut":false,"hidden":false,"merged":[]}
["#","Answer the below questions to see suggested specific policies and programs","Choose yes/no/maybe "]
[1,"Do you struggle with limited staff capacity? Are you interested in ideas to better manage your affordable portfolio?"]
[2,"Are you interested in actively promoting missing middle housing (duplexes, triplexes, quads)?"]
[3,"Are parking requirements or existing development standards an obstacle to new development?"]
[4,"Are you interested in reducing discretionary review?"]
[5,"Does your jurisdiction have a problem where commercial uses outcompete residential in mixed use zones?"]
[6,"Do you get feedback that the development review and approval process should be improved?"]
[7,"Are you interested in micro units or modular housing?"]
[8,"Are there areas you are planning on upzoning? Are you looking for opportunities to increase density?"]
[9,"Do you get feedback that your fees or offsite improvement requirements are high?"]
[10,"Are you looking for policies to reduce wildfire risk?"]
[11,"Is there interest in new sources of funding for affordable housing?"]
[12,"Do you want to make it easier for affordable housing to get built?"]
[13,"Do you think there are opportunities for housing development on public, nonprofit or institutional sites?"]
[14,"Are you looking to increase ADU production?"]
[15,"Is there an interest in promoting stronger tenant protections?"]
[16,"Are you concerned that you are not doing enough on fair housing?"]
[17,"Are foreclosures or evictions on your mind?"]
[18,"Do you think that short term vacation rentals may be eating away at your housing stock?"]
[19,"Do you worry about expiring affordable units?"]
[20,"Do you need to examine your impact fees, inclusionary zoning or density bonus requirements for their effectiveness in meeting needs?"]
[21,"Do you need to provide more extremely low income housing opportunities or short-term solutions for homelessness?"]
[22,"Do you worry about condo conversions?"]
[23,"Do you want to promote energy-efficient housing? "]
[24,"Are you interested in achieving Pro-Housing certification through HCD?*"]
[]
[null,"*HCD's Prohousing Designation Program provides incentives to cities and counties in the form of additional points or other preference in the scoring of competitive housing, community development, and infrastructure programs. https://www.hcd.ca.gov/community-development/prohousing/index.shtml "]

{"sheet":"2) potential programs","index":2,"n_rows":147,"n_cols":6,"rows_kept":147,"cut":false,"hidden":false,"merged":[]}
["Interest Level","GOAL/IDEA","POLICY OR PROGRAM","Are you interested in this specific policy or program? Check yes/no/maybe"]
[]
[null,"Yes"]
["yes","Target new areas for upzoning","Review multifamily development standards in the ___ zone, to allow greater intensity, including: floor area ratio; height limits; minimum lot or unit sizes; setbacks; and allowable dwelling units per acre",null,8,"Review multifamily development standards in the ___ zone, to allow greater intensity, including: floor area ratio; height limits; minimum lot or unit sizes; setbacks; and allowable dwelling units per acre"]
[null,null,"Establish specific plans/areas with accompanying Environmental Impact Reports that will allow for streamlined housing approvals. Identify which areas. ",null,8,"Establish specific plans/areas with accompanying Environmental Impact Reports that will allow for streamlined housing approvals. Identify which areas. "]
[null,null,null,null,null,"Establish one-stop-shop permitting processes or a single point of contact where entitlements are coordinated across city approval functions (e.g., planning, public works, building) from entitlement application to certificate of occupancy."]
[null,null,null,null,null,"Hire an outside firm to review the application review and approval process and identify improvements"]
[null,null,null,null,null,"Establish a committee of relevant stakeholders to review the application review and approval process and identify improvements"]
[null,null,null,null,null,"Offer pre-application development conferences."]
[null,null,null,null,null,"Publicly post status updates on project permit approvals on the Internet."]
[null,null,null,null,null,"Establish priority permit processing or reduced plan check times for ADUs/JADUs, multifamily housing, OR homes affordable to lower- or moderate-income households. Jurisdiction should choose one category to prioritize"]
[null,null,null,null,null,"Adopt form-based code and objective standards to support streamlined approval. Identify which areas"]
[null,null,null,null,null,"Consolidate fee schedules (across departments) to simplify administration and allow people to obtain schedules and documentation in one location. This includes gathering information from outside agency fees."]
[null,null,null,null,null,"Offer greater FAR, height and other zoning standards for residential developments in mixed use zones."]
[null,null,null,null,null,"List all affordable housing projects and inclusionary units on Doorway, a new regional platform for searching and applying for affordable housing "]
[null,null,null,null,null,"Hire a third party to manage the jurisdiction's affordable housing portfolio"]
[null,null,null,null,null,"Ensure that all new affordable housing remains affordable for 99 years or in perpetuity."]
[null,null,null,null,null,"Review and improve existing affordable housing compliance and monitoring process (especially for inclusionary units)"]
[null,null,null,null,null,"Adopt a policy to retain public land over the long term when possible, doing ground leases rather than selling property (including for affordable housing)"]
[null,null,null,null,null,"Have new affordable BMR ownership units become part of a community land trust"]
[null,null,null,null,null,"Seek Prohousing designation from HCD, which gives preference to the jurisdiction when applying for funding "]
[null,null,null,null,null,"Establish an early warning system and monitor at-risk units. Create a list based on at-risk units in the ten-year inventory and analyses (conversion risk, costs, and resources) for possible conversions within the current and next planning period. Monitor the list on a regular basis (e.g. every six to twelve months)."]
[null,null,null,null,null,"Register with State HCD as a Qualified Entity to receive notices of properties facing a potential loss of affordability."]
[null,null,null,null,null,"Contact owners of the highest risk properties to determine their intentions and explore options. Establish a relationship and meet with property owners of at-risk units on an annual basis."]
[null,null,null,null,null,"Offer local incentives (lower-interest rate loans and more favorable loan terms and conditions) to owners wishing to refinance and prepay their existing mortgage in exchange for continued affordability restrictions."]
[null,null,null,null,null,"Regulate short-term rentals to keep housing on the market for residents"]
[null,null,null,null,null,"Establish condo conversion ordinances to regulate the conversion of existing rental housing to ownership housing"]
[null,null,null,null,null,"Adopt reach codes that offer higher standards for energy efficiency and electrification of housing."]
[null,null,null,null,null,"Provide information to residents on energy efficiency and electrification incentives from PG&E, BayREN, and others. "]
[null,null,null,null,null,"Encourage water utilities to participate in BayREN's Water Upgrade $aves Program in order to make water efficiency improvements available to residents at no upfront cost."]
{"$rows_left_out":118}
{"sheet":"3) short list ","index":3,"n_rows":1,"n_cols":4,"rows_kept":1,"cut":false,"hidden":false,"merged":[]}
["Interest Level","GOAL/IDEA","POLICY OR PROGRAM","RESOURCE LINK"]

{"sheet":"policies","index":4,"n_rows":124,"n_cols":9,"rows_kept":124,"cut":false,"hidden":false,"merged":[]}
["question code","alt question code","match 1","alt match","interest or no","GOAL/IDEA","Interest","POLICY OR PROGRAM","Link"]
[1,null,{"$f":"IF(ISNUMBER(MATCH(A2,'1) screener questions'!#REF!,0)),1,0)","v":0},{"$f":"IF(ISNUMBER(MATCH(B2,'1) screener questions'!#REF!,0)),1,0)","v":0},{"$f":"IF(OR(C2=1,D2=1),\"interest\",\"no interest\")","v":"no interest"},"Grow jurisdiction's housing staff capacity with limited resources",null,"Join with other cities in San Mateo County to share housing staff to support the housing trust/inclusionary zoning/100% affordable housing/other projects"]
[1,null,{"$f":"IF(ISNUMBER(MATCH(A3,'1) screener questions'!#REF!,0)),1,0)","v":0},{"$f":"IF(ISNUMBER(MATCH(B3,'1) screener questions'!#REF!,0)),1,0)","v":0},{"$f":"IF(OR(C3=1,D3=1),\"interest\",\"no interest\")","v":"no interest"},"Grow jurisdiction's housing staff capacity with limited resources",null,"Use a small percentage of the housing trust fund to pay for housing staffing"]
[2,null,{"$f":"IF(ISNUMBER(MATCH(A4,'1) screener questions'!#REF!,0)),1,0)","v":0},{"$f":"IF(ISNUMBER(MATCH(B4,'1) screener questions'!#REF!,0)),1,0)","v":0},"no interest","Promote small-scale multifamily housing (\"missing middle\")",null,"Review development standards to facilitate missing middle housing (particularly related to parking, FAR/density, parking, height, lot size and lot coverage). Jurisdiction to add more. ","https://abag.ca.gov/technical-assistance/making-middle-housing-happen"]
[2,null,{"$f":"IF(ISNUMBER(MATCH(A5,'1) screener questions'!#REF!,0)),1,0)","v":0},{"$f":"IF(ISNUMBER(MATCH(B5,'1) screener questions'!#REF!,0)),1,0)","v":0},"no interest","Promote small-scale multifamily housing (\"missing middle\")",null,"Review development approvals process to facilitate missing middle housing to ensure that is it as easy to get approval for middle housing as for a single family home","https://abag.ca.gov/technical-assistance/making-middle-housing-happen"]
[2,null,{"$f":"IF(ISNUMBER(MATCH(A6,'1) screener questions'!#REF!,0)),1,0)","v":0},{"$f":"IF(ISNUMBER(MATCH(B6,'1) screener questions'!#REF!,0)),1,0)","v":0},"no interest","Promote small-scale multifamily housing (\"missing middle\")",null,"Develop objective standards for duplexes, triplexes and quads.","https://abag.ca.gov/technical-assistance/making-middle-housing-happen"]
[2,null,{"$f":"IF(ISNUMBER(MATCH(A7,'1) screener questions'!#REF!,0)),1,0)","v":0},{"$f":"IF(ISNUMBER(MATCH(B7,'1) screener questions'!#REF!,0)),1,0)","v":0},"no interest","Promote small-scale multifamily housing (\"missing middle\")",null,"Provide financial incentives for missing middle housing projects (impact fee reductions/waivers, property tax abatement, permitting fee reductions/waivers, waiving public improvement requirements","https://abag.ca.gov/technical-assistance/making-middle-housing-affordable"]
[3,null,{"$f":"IF(ISNUMBER(MATCH(A8,'1) screener questions'!#REF!,0)),1,0)","v":0},{"$f":"IF(ISNUMBER(MATCH(B8,'1) screener questions'!#REF!,0)),1,0)","v":0},"no interest","Reduce parking requirements to make housing development less costly ",null,"Adopt policies that reduce parking minimums, establish parking maximums and encourage or facilitate other practices that reduce cost and the amount of space dedicated to cars. Jurisdiction to add more. ","https://abag.ca.gov/technical-assistance/parking-policy-playbook"]
[4,null,{"$f":"IF(ISNUMBER(MATCH(A9,'1) screener questions'!#REF!,0)),1,0)","v":0},{"$f":"IF(ISNUMBER(MATCH(B9,'1) screener questions'!#REF!,0)),1,0)","v":0},"no interest","Adopt by-right housing (reducing discretion, more objective standards) for more types of housing",null,"Eliminate or replace subjective development and design standards with objective development and design standards that simplify zoning clearance and improve approval certainty and timing. Specifically, _____","https://abag.ca.gov/technical-assistance/results?search=objective+design+standards"]
[4,null,{"$f":"IF(ISNUMBER(MATCH(A10,'1) screener questions'!#REF!,0)),1,0)","v":0},{"$f":"IF(ISNUMBER(MATCH(B10,'1) screener questions'!#REF!,0)),1,0)","v":0},"no interest","Adopt by-right housing (reducing discretion, more objective standards) for more types of housing",null,"Establish form-based codes that can be paired with by-right approvals. Identify which areas","https://abag.ca.gov/technical-assistance/results?search=form-based+codes"]
[5,null,{"$f":"IF(ISNUMBER(MATCH(A11,'1) screener questions'!#REF!,0)),1,0)","v":0},{"$f":"IF(ISNUMBER(MATCH(B11,'1) screener questions'!#REF!,0)),1,0)","v":0},"no interest","Allow residential to better compete in zones that allow residential and commercial",null,"Require applicants to build housing when applying to build commercial developments in mixed use zones"]
[5,null,{"$f":"IF(ISNUMBER(MATCH(A12,'1) screener questions'!#REF!,0)),1,0)","v":0},{"$f":"IF(ISNUMBER(MATCH(B12,'1) screener questions'!#REF!,0)),1,0)","v":0},"no interest","Allow residential to better compete in zones that allow residential and commercial",null,"Offer greater FAR, height and other zoning standards for residential developments in mixed use zones."]
[6,null,{"$f":"IF(ISNUMBER(MATCH(A13,'1) screener questions'!#REF!,0)),1,0)","v":0},{"$f":"IF(ISNUMBER(MATCH(B13,'1) screener questions'!#REF!,0)),1,0)","v":0},"no interest","Improve development review and approval process",null,"Establish one-stop-shop permitting processes or a single point of contact where entitlements are coordinated across city approval functions (e.g., planning, public works, building) from entitlement application to certificate of occupancy."]
[6,null,{"$f":"IF(ISNUMBER(MATCH(A14,'1) screener questions'!#REF!,0)),1,0)","v":0},{"$f":"IF(ISNUMBER(MATCH(B14,'1) screener questions'!#REF!,0)),1,0)","v":0},"no interest","Improve development review and approval process",null,"Hire an outside firm to review the application review and approval process and identify improvements"]
[6,null,{"$f":"IF(ISNUMBER(MATCH(A15,'1) screener questions'!#REF!,0)),1,0)","v":0},{"$f":"IF(ISNUMBER(MATCH(B15,'1) screener questions'!#REF!,0)),1,0)","v":0},"no interest","Improve development review and approval process",null,"Establish a committee of relevant stakeholders to review the application review and approval process and identify improvements"]
[6,null,{"$f":"IF(ISNUMBER(MATCH(A16,'1) screener questions'!#REF!,0)),1,0)","v":0},{"$f":"IF(ISNUMBER(MATCH(B16,'1) screener questions'!#REF!,0)),1,0)","v":0},"no interest","Improve development review and approval process",null,"Offer pre-application development conferences."]
[6,null,{"$f":"IF(ISNUMBER(MATCH(A17,'1) screener questions'!#REF!,0)),1,0)","v":0},{"$f":"IF(ISNUMBER(MATCH(B17,'1) screener questions'!#REF!,0)),1,0)","v":0},"no interest","Improve development review and approval process",null,"Publicly post status updates on project permit approvals on the Internet."]
[6,null,{"$f":"IF(ISNUMBER(MATCH(A18,'1) screener questions'!#REF!,0)),1,0)","v":0},{"$f":"IF(ISNUMBER(MATCH(B18,'1) screener questions'!#REF!,0)),1,0)","v":0},"no interest","Improve development review and approval process",null,"Establish priority permit processing or reduced plan check times for ADUs/JADUs, multifamily housing, OR homes affordable to lower- or moderate-income households. Jurisdiction should choose one category to prioritize"]
[7,null,{"$f":"IF(ISNUMBER(MATCH(A19,'1) screener questions'!#REF!,0)),1,0)","v":0},{"$f":"IF(ISNUMBER(MATCH(B19,'1) screener questions'!#REF!,0)),1,0)","v":0},"no interest","Promote innovative housing types and construction methods",null,"Establish a clear and expedited approval and permitting process for modular and manufactured homes"]
[7,null,{"$f":"IF(ISNUMBER(MATCH(A20,'1) screener questions'!#REF!,0)),1,0)","v":0},{"$f":"IF(ISNUMBER(MATCH(B20,'1) screener questions'!#REF!,0)),1,0)","v":0},"no interest","Promote innovative housing types and construction methods",null,"Permit micro-unit development and SRO units"]
[8,3,{"$f":"IF(ISNUMBER(MATCH(A21,'1) screener questions'!#REF!,0)),1,0)","v":0},{"$f":"IF(ISNUMBER(MATCH(B21,'1) screener questions'!#REF!,0)),1,0)","v":0},"no interest","Target new areas for upzoning",null,"Review multifamily development standards in the ___ zone, to allow greater intensity, including: floor area ratio; height limits; minimum lot or unit sizes; setbacks; and allowable dwelling units per acre"]
[8,null,{"$f":"IF(ISNUMBER(MATCH(A22,'1) screener questions'!#REF!,0)),1,0)","v":0},{"$f":"IF(ISNUMBER(MATCH(B22,'1) screener questions'!#REF!,0)),1,0)","v":0},"no interest","Target new areas for upzoning",null,"Establish specific plans/areas with accompanying Environmental Impact Reports that will allow for streamlined housing approvals. Identify which areas. "]
[6,null,{"$f":"IF(ISNUMBER(MATCH(A23,'1) screener questions'!#REF!,0)),1,0)","v":0},{"$f":"IF(ISNUMBER(MATCH(B23,'1) screener questions'!#REF!,0)),1,0)","v":0},"no interest","Improve development review and approval process",null,"Adopt form-based code and objective standards to support streamlined approval. Identify which areas","https://abag.ca.gov/technical-assistance/results?search=objective+design+standards\n\nhttps://abag.ca.gov/technical-assistance/results?search=form-based+codes "]
[9,null,{"$f":"IF(ISNUMBER(MATCH(A24,'1) screener questions'!#REF!,0)),1,0)","v":0},{"$f":"IF(ISNUMBER(MATCH(B24,'1) screener questions'!#REF!,0)),1,0)","v":0},"no interest","Reduce fees paid by housing development projects",null,"Adopt a policy allowing for payment of fees upon certificate or occupancy, rather than prior to building permit issuance, to reduce developer construction financing costs and overall development costs."]
[6,null,{"$f":"IF(ISNUMBER(MATCH(A25,'1) screener questions'!#REF!,0)),1,0)","v":0},{"$f":"IF(ISNUMBER(MATCH(B25,'1) screener questions'!#REF!,0)),1,0)","v":0},"no interest","Improve development review and approval process",null,"Consolidate fee schedules (across departments) to simplify administration and allow people to obtain schedules and documentation in one location. This includes gathering information from outside agency fees."]
[9,null,{"$f":"IF(ISNUMBER(MATCH(A26,'1) screener questions'!#REF!,0)),1,0)","v":0},{"$f":"IF(ISNUMBER(MATCH(B26,'1) screener questions'!#REF!,0)),1,0)","v":0},"no interest","Reduce fees paid by housing development projects",null,"Evaluate and reduce excessive requirements for on or offsite improvements"]
[10,null,{"$f":"IF(ISNUMBER(MATCH(A27,'1) screener questions'!#REF!,0)),1,0)","v":0},{"$f":"IF(ISNUMBER(MATCH(B27,'1) screener questions'!#REF!,0)),1,0)","v":0},"no interest","Plan responsibly for housing development in wildfire risk areas",null,"Establish clear and consistent standards for fire resistant buildings and landscaping"]
[12,null,{"$f":"IF(ISNUMBER(MATCH(A28,'1) screener questions'!#REF!,0)),1,0)","v":0},{"$f":"IF(ISNUMBER(MATCH(B28,'1) screener questions'!#REF!,0)),1,0)","v":0},"no interest","Give affordable housing a zoning boost over other uses and other types of housing",null,"Allow 100% affordable housing in all zones other than heavy industrial zones, even where other housing is not currently allowed"]
[20,null,{"$f":"IF(ISNUMBER(MATCH(A29,'1) screener questions'!#REF!,0)),1,0)","v":0},{"$f":"IF(ISNUMBER(MATCH(B29,'1) screener questions'!#REF!,0)),1,0)","v":0},"no interest","Generate more funding and opportunities for affordable housing",null,"Review and update inclusionary requirements","https://inclusionaryhousing.org/"]
[20,null,{"$f":"IF(ISNUMBER(MATCH(A30,'1) screener questions'!#REF!,0)),1,0)","v":0},{"$f":"IF(ISNUMBER(MATCH(B30,'1) screener questions'!#REF!,0)),1,0)","v":0},"no interest","Generate more funding and opportunities for affordable housing",null,"Review and update housing impact or in-lieu fees","https://inclusionaryhousing.org/designing-a-policy/off-site-development/in-lieu-fees/"]
{"$rows_left_out":94}